Target
Programmed cell death 1 ligand/protein 1
Ligand
BDBM474502
Substrate
Meas. Tech.
Inhibitory Activity Assay
IC50
40.5±n/a nM
Citation
 Feng, ZChen, XYang, YZhou, CLai, FJi, MJin, XXue, NZheng, YChen, HLi, L Phenylate derivative, preparation method therefor, and pharmaceutical composition and uses thereof US Patent  US10882833 Publication Date 1/5/2021 
Target
Name:
Programmed cell death 1 ligand/protein 1
Synonyms:
PD-1/PD-L1 | Programmed cell death protein 1/Programmed cell death 1 ligand 1
Type:
Protein
Mol. Mass.:
Description:
Components:
This complex has 2 components.
Component 1
Name:
Programmed cell death protein 1
Synonyms:
CD_antigen=CD279 PDCD1 Programmed cell death protein 1 hPD-1
Type:
PROTEIN
Mol. Mass.:
31650.07
Organism:
Homo sapiens
Description:
ChEMBL_108437
Residue:
288
  
Component 2
Name:
Programmed cell death 1 ligand 1
Synonyms:
B7 homolog 1 B7H1 CD274 PD-L1 PDCD1 ligand 1 PDCD1LG1 Programmed cell death 1 ligand 1 | Programmed death ligand 1
Type:
PROTEIN
Mol. Mass.:
33278.49
Organism:
Homo sapiens (Human)
Description:
ChEMBL_109807
Residue:
290
  
Inhibitor
Name:
BDBM474502
Synonyms:
(S,S)—N-(4-(2-bromo-3-(2,3-dihydrobenzo[b][1,4]dioxin-6-yl)benzyloxy)-5-chloro-2-(cyclopropylmethoxy)benzyl)-4-hydroxyproline | US10882833, Example 17
Type:
Small organic molecule
Emp. Form.:
C31H31BrClNO7
Mol. Mass.:
644.937
SMILES:
O[C@H]1C[C@H](N(Cc2cc(Cl)c(OCc3cccc(c3Br)-c3ccc4OCCOc4c3)cc2OCC2CC2)C1)C(O)=O
: