Target
Programmed cell death 1 ligand/protein 1
Ligand
BDBM477031
Substrate
Meas. Tech.
Homogenous Time-Resolved Fluorescence (HTRF) binding assay
IC50
0.59±n/a nM
Citation
 Yeung, KGrant-Young, KASun, LLangley, DRSt. Laurent, DRScola, PM Compounds useful as immunomodulators US Patent  US10882844 Publication Date 1/5/2021 
Target
Name:
Programmed cell death 1 ligand/protein 1
Synonyms:
PD-1/PD-L1 | Programmed cell death protein 1/Programmed cell death 1 ligand 1
Type:
Protein
Mol. Mass.:
Description:
Components:
This complex has 2 components.
Component 1
Name:
Programmed cell death protein 1
Synonyms:
CD_antigen=CD279 PDCD1 Programmed cell death protein 1 hPD-1
Type:
PROTEIN
Mol. Mass.:
31650.07
Organism:
Homo sapiens
Description:
ChEMBL_108437
Residue:
288
  
Component 2
Name:
Programmed cell death 1 ligand 1
Synonyms:
B7 homolog 1 B7H1 CD274 PD-L1 PDCD1 ligand 1 PDCD1LG1 Programmed cell death 1 ligand 1 | Programmed death ligand 1
Type:
PROTEIN
Mol. Mass.:
33278.49
Organism:
Homo sapiens (Human)
Description:
ChEMBL_109807
Residue:
290
  
Inhibitor
Name:
BDBM477031
Synonyms:
US10882844, Example 2009
Type:
Small organic molecule
Emp. Form.:
C38H41ClN6O5
Mol. Mass.:
697.222
SMILES:
CN1CCN(CC1)c1nc2cc(ccc2o1)-c1cccc(COc2cc(OCc3cncc(c3)C#N)c(CNC(C)(CO)CO)cc2Cl)c1C
: