Target
Hepatocyte growth factor receptor
Ligand
BDBM477046
Substrate
Meas. Tech.
Inhibitory Activity Assay
IC50
6.64±n/a nM
Citation
 Sun, FZhan, Y Tyrosine kinase inhibitor and application thereof US Patent  US10882853 Publication Date 1/5/2021 
Target
Name:
Hepatocyte growth factor receptor
Synonyms:
Hepatocyte growth factor receptor Hepatocyte growth factor receptor (c-MET) MET Met proto-oncogene (hepatocyte growth factor receptor) Tyrosine-protein kinase Met (c-Met) c-Met kinase
Type:
Protein
Mol. Mass.:
155559.73
Organism:
Homo sapiens (Human)
Description:
P08581
Residue:
1390
  
Inhibitor
Name:
BDBM477046
Synonyms:
US10882853, Compound 15
Type:
Small organic molecule
Emp. Form.:
C34H32F4N4O6
Mol. Mass.:
668.6347
SMILES:
COc1cc2c(Oc3ccc(NC(=O)C4(CC4)C(=O)Nc4ccc(F)cc4)cc3F)ccnc2cc1OCC(F)(F)CN1CCOCC1
: