Target
Vascular endothelial growth factor receptor 2
Ligand
BDBM477041
Substrate
Meas. Tech.
Inhibitory Activity Assay
IC50
14.8±n/a nM
Citation
 Sun, FZhan, Y Tyrosine kinase inhibitor and application thereof US Patent  US10882853 Publication Date 1/5/2021 
Target
Name:
Vascular endothelial growth factor receptor 2
Synonyms:
CD_antigen=CD309 Fetal liver kinase 1 (FLK-1) KDR Protein-tyrosine kinase receptor Flk-1 VEGFR-2 VEGFR2 Vascular Endothelial Growth Factor Receptor Kinase 2 Vascular endothelial growth factor receptor 2 (KDR) Vascular endothelial growth factor receptor 2 (VEGFR2) Vascular endothelial growth factor receptor-2 (VEGFR-2)
Type:
Receptor Tyrosine Kinase
Mol. Mass.:
151510.97
Organism:
Homo sapiens (Human)
Description:
P35968
Residue:
1356
  
Inhibitor
Name:
BDBM477041
Synonyms:
US10882853, Compound Foretinib
Type:
Small organic molecule
Emp. Form.:
C34H35FN4O6
Mol. Mass.:
614.6633
SMILES:
COc1cc2c(Oc3ccc(NC(=O)C4(CC4)C(=O)Nc4ccc(F)cc4)cc3)ccnc2cc1OCCCN1CCOCC1
: