Target
Ectonucleotide pyrophosphatase/phosphodiesterase family member 2
Ligand
BDBM477042
Substrate
Meas. Tech.
Enzyme Inhibition Assay
IC50
2.00±n/a nM
Citation
 Hert, JHunziker, DMattei, PRudolph, MSchmitz, PDi Giorgio, P Bicyclic compounds as ATX inhibitors US Patent  US10882857 Publication Date 1/5/2021 
Target
Name:
Ectonucleotide pyrophosphatase/phosphodiesterase family member 2
Synonyms:
ATX Autotaxin (ATX) ENPP2 Ectonucleotide Pyrophosphatase/Phosphodiesterase 2 (ENPP2) Extracellular lysophospholipase D PDNP2
Type:
Enzyme
Mol. Mass.:
99007.13
Organism:
Homo sapiens (Human)
Description:
Q13822
Residue:
863
  
Inhibitor
Name:
BDBM477042
Synonyms:
US10882857, Example 1 [2-[2-Cyclopropyl-6-(oxan-4-ylmethoxy)pyridine-4-carbonyl]-3,4-dihydro-1H-isoquinolin-6-yl]-(1,4,6,7-tetrahydrotriazolo[4,5-c]pyridin-5-yl)methanone
Type:
Small organic molecule
Emp. Form.:
C30H34N6O4
Mol. Mass.:
542.6288
SMILES:
O=C(N1CCc2[nH]nnc2C1)c1ccc2CN(CCc2c1)C(=O)c1cc(OCC2CCOCC2)nc(c1)C1CC1
: