Target
Tyrosine-protein kinase JAK3
Ligand
BDBM477065
Substrate
Meas. Tech.
Biochemical Assay
Kd
1.90±n/a nM
Citation
 Fyfe, MC Kinase inhibitors US Patent  US10882859 Publication Date 1/5/2021 
Target
Name:
Tyrosine-protein kinase JAK3
Synonyms:
JAK-3 JAK3_HUMAN Janus kinase 3 (JAK3) L-JAK | Leukocyte janus kinase
Type:
Protein
Mol. Mass.:
125111.08
Organism:
Homo sapiens (Human)
Description:
P52333
Residue:
1124
  
Inhibitor
Name:
BDBM477065
Synonyms:
US10882859, Reference compound PF-06263276
Type:
Small organic molecule
Emp. Form.:
C31H31FN8O2
Mol. Mass.:
566.6286
SMILES:
CCc1cc(O)c(F)cc1-c1ccc2c(n[nH]c2c1)-c1nc2CCN(Cc2[nH]1)C(=O)c1cnc(cn1)N1CCCCC1
: