Target
Egl nine homolog 1
Ligand
BDBM477227
Substrate
Meas. Tech.
EGLN-1 Activity Assay
IC50
378±33.3 nM
Citation
 You, QZhang, XLei, YHu, TWu, XSun, HGuo, XXu, X Alkynyl pyridine prolyl hydroxylase inhibitor, and preparation method and medical use thereof US Patent  US10889546 Publication Date 1/12/2021 
Target
Name:
Egl nine homolog 1
Synonyms:
C1orf12 EGLN1_HUMAN Hypoxia-inducible factor prolyl hydroxylase 2 (HIF-PH2) Prolyl hydroxylase domain-containing protein 2 (PHD2)
Type:
Protein
Mol. Mass.:
46035.59
Organism:
Homo sapiens (Human)
Description:
Q9GZT9
Residue:
426
  
Inhibitor
Name:
BDBM477227
Synonyms:
US10889546, Example 36
Type:
Small organic molecule
Emp. Form.:
C19H18N2O5
Mol. Mass.:
354.3566
SMILES:
CCc1ccc(OCC#Cc2cnc(C(=O)NCC(O)=O)c(O)c2)cc1
: