Target
Egl nine homolog 1
Ligand
BDBM477242
Substrate
Meas. Tech.
EGLN-1 Activity Assay
IC50
311±5.4 nM
Citation
 You, QZhang, XLei, YHu, TWu, XSun, HGuo, XXu, X Alkynyl pyridine prolyl hydroxylase inhibitor, and preparation method and medical use thereof US Patent  US10889546 Publication Date 1/12/2021 
Target
Name:
Egl nine homolog 1
Synonyms:
C1orf12 EGLN1_HUMAN Hypoxia-inducible factor prolyl hydroxylase 2 (HIF-PH2) Prolyl hydroxylase domain-containing protein 2 (PHD2)
Type:
Protein
Mol. Mass.:
46035.59
Organism:
Homo sapiens (Human)
Description:
Q9GZT9
Residue:
426
  
Inhibitor
Name:
BDBM477242
Synonyms:
US10889546, Example 50
Type:
Small organic molecule
Emp. Form.:
C19H17N3O6
Mol. Mass.:
383.3548
SMILES:
CC(=O)Nc1ccc(OCC#Cc2cnc(C(=O)NCC(O)=O)c(O)c2)cc1
: