Target
Egl nine homolog 1
Ligand
BDBM477252
Substrate
Meas. Tech.
EGLN-1 Activity Assay
IC50
399±3.4 nM
Citation
 You, QZhang, XLei, YHu, TWu, XSun, HGuo, XXu, X Alkynyl pyridine prolyl hydroxylase inhibitor, and preparation method and medical use thereof US Patent  US10889546 Publication Date 1/12/2021 
Target
Name:
Egl nine homolog 1
Synonyms:
C1orf12 EGLN1_HUMAN Hypoxia-inducible factor prolyl hydroxylase 2 (HIF-PH2) Prolyl hydroxylase domain-containing protein 2 (PHD2)
Type:
Protein
Mol. Mass.:
46035.59
Organism:
Homo sapiens (Human)
Description:
Q9GZT9
Residue:
426
  
Inhibitor
Name:
BDBM477252
Synonyms:
US10889546, Example 60
Type:
Small organic molecule
Emp. Form.:
C19H14N2O6
Mol. Mass.:
366.3243
SMILES:
OC(=O)CNC(=O)c1ncc(cc1O)C#CCOc1cccc2ccoc12
: