Target
Muscarinic acetylcholine receptor M1/M2
Ligand
BDBM477564
Substrate
Meas. Tech.
Inhibition Effect
IC50
90.0±n/a nM
Citation
 Miyahara, SUeno, HHara, SOgino, Y Sulfonamide compound or salt thereof US Patent  US10889555 Publication Date 1/12/2021 
Target
Name:
Muscarinic acetylcholine receptor M1/M2
Synonyms:
Human RNR
Type:
Protein
Mol. Mass.:
Description:
Components:
This complex has 2 components.
Component 1
Name:
Muscarinic acetylcholine receptor M1
Synonyms:
ACM1_HUMAN Cholinergic receptor, muscarinic 1 | Cholinergic, muscarinic M1
Type:
Protein
Mol. Mass.:
51442.54
Organism:
Homo sapiens (Human)
Description:
P11229
Residue:
460
  
Component 2
Name:
Muscarinic acetylcholine receptor M2
Synonyms:
ACM2_HUMAN Cholinergic, muscarinic M2 Muscarinic acetylcholine receptor M2 and M5 | RecName: Full=Muscarinic acetylcholine receptor M2
Type:
GPCR
Mol. Mass.:
51730.61
Organism:
Homo sapiens (Human)
Description:
P08172
Residue:
466
  
Inhibitor
Name:
BDBM477564
Synonyms:
4-cyano-N-(1S,2R)-(6-fluoro-2,3-dimethylphenyl)-1-(5-oxo-4,5- dihydro-1,3,4-oxadiazol-2-yl)propyl)-2-methoxybenzenesulfonamide US11634395, Example 342
Type:
Small organic molecule
Emp. Form.:
C21H21FN4O5S
Mol. Mass.:
460.479
SMILES:
COc1cc(ccc1S(=O)(=O)N[C@@H]([C@H](C)c1c(F)ccc(C)c1C)c1n[nH]c(=O)o1)C#N
: