Target
Dihydroorotate dehydrogenase (quinone), mitochondrial
Ligand
BDBM477594
Substrate
Meas. Tech.
Inhibition Assay
IC50
66.0±n/a nM
Citation
 Lain, SDrummond, CLeeuwen, IVHaraldsson, MJohansson, LSandberg, LYngve, U Tetrahydroindazoles and medical uses thereof US Patent  US10889564 Publication Date 1/12/2021 
Target
Name:
Dihydroorotate dehydrogenase (quinone), mitochondrial
Synonyms:
DHODH Dihydroorotate dehydrogenase Dihydroorotate dehydrogenase, mitochondrial Dihydroorotate oxidase (DHODH) | PYRD_HUMAN
Type:
Enzyme
Mol. Mass.:
42881.33
Organism:
Homo sapiens (Human)
Description:
Q02127
Residue:
395
  
Inhibitor
Name:
BDBM477594
Synonyms:
5-methyl-N-[(4R)-1-(2-methylphenyl)-4,5,6,7-tetrahydro-1H-indazol-4-yl]pyridine-2-carboxamide | US10889564, Example 24
Type:
Small organic molecule
Emp. Form.:
C21H22N4O
Mol. Mass.:
346.4256
SMILES:
Cc1ccc(nc1)C(=O)N[C@@H]1CCCc2c1cnn2-c1ccccc1C
: