Target
Dihydroorotate dehydrogenase (quinone), mitochondrial
Ligand
BDBM477602
Substrate
Meas. Tech.
Inhibition Assay
IC50
30.0±n/a nM
Citation
 Lain, SDrummond, CLeeuwen, IVHaraldsson, MJohansson, LSandberg, LYngve, U Tetrahydroindazoles and medical uses thereof US Patent  US10889564 Publication Date 1/12/2021 
Target
Name:
Dihydroorotate dehydrogenase (quinone), mitochondrial
Synonyms:
DHODH Dihydroorotate dehydrogenase Dihydroorotate dehydrogenase, mitochondrial Dihydroorotate oxidase (DHODH) | PYRD_HUMAN
Type:
Enzyme
Mol. Mass.:
42881.33
Organism:
Homo sapiens (Human)
Description:
Q02127
Residue:
395
  
Inhibitor
Name:
BDBM477602
Synonyms:
Ethyl 3-[4-(4,5,6,7-tetrahydro-1,2-benzoxazole-3-amido)-4,5,6,7-tetrahydro-1H-indazol-1-yl]benzoate | US10889564, Example 32
Type:
Small organic molecule
Emp. Form.:
C24H26N4O4
Mol. Mass.:
434.4876
SMILES:
CCOC(=O)c1cccc(c1)-n1ncc2C(CCCc12)NC(=O)c1noc2CCCCc12
: