Target
Dihydroorotate dehydrogenase (quinone), mitochondrial
Ligand
BDBM477609
Substrate
Meas. Tech.
Inhibition Assay
IC50
25.0±n/a nM
Citation
 Lain, SDrummond, CLeeuwen, IVHaraldsson, MJohansson, LSandberg, LYngve, U Tetrahydroindazoles and medical uses thereof US Patent  US10889564 Publication Date 1/12/2021 
Target
Name:
Dihydroorotate dehydrogenase (quinone), mitochondrial
Synonyms:
DHODH Dihydroorotate dehydrogenase Dihydroorotate dehydrogenase, mitochondrial Dihydroorotate oxidase (DHODH) | PYRD_HUMAN
Type:
Enzyme
Mol. Mass.:
42881.33
Organism:
Homo sapiens (Human)
Description:
Q02127
Residue:
395
  
Inhibitor
Name:
BDBM477609
Synonyms:
N-[(4R)-1-(2-fluorophenyl)-4,5,6,7-tetrahydro-1H-indazol-4-yl]-4-(trifluoromethyl)pyridine-2-carboxamide | US10889564, Example 39
Type:
Small organic molecule
Emp. Form.:
C20H16F4N4O
Mol. Mass.:
404.3609
SMILES:
Fc1ccccc1-n1ncc2[C@@H](CCCc12)NC(=O)c1cc(ccn1)C(F)(F)F
: