Target
Dihydroorotate dehydrogenase (quinone), mitochondrial
Ligand
BDBM477616
Substrate
Meas. Tech.
Inhibition Assay
IC50
6.00±n/a nM
Citation
 Lain, SDrummond, CLeeuwen, IVHaraldsson, MJohansson, LSandberg, LYngve, U Tetrahydroindazoles and medical uses thereof US Patent  US10889564 Publication Date 1/12/2021 
Target
Name:
Dihydroorotate dehydrogenase (quinone), mitochondrial
Synonyms:
DHODH Dihydroorotate dehydrogenase Dihydroorotate dehydrogenase, mitochondrial Dihydroorotate oxidase (DHODH) | PYRD_HUMAN
Type:
Enzyme
Mol. Mass.:
42881.33
Organism:
Homo sapiens (Human)
Description:
Q02127
Residue:
395
  
Inhibitor
Name:
BDBM477616
Synonyms:
(R)—N-(1-(2-fluorophenyl)-4,5,6,7-tetrahydro-1H-indazol-4-yl)-5,6,7,8-tetrahydroimidazo[1,5-a]pyridine-1-carboxamide | US10889564, Example 46
Type:
Small organic molecule
Emp. Form.:
C21H22FN5O
Mol. Mass.:
379.4307
SMILES:
Fc1ccccc1-n1ncc2[C@@H](CCCc12)NC(=O)c1ncn2CCCCc12
: