Target
Short transient receptor potential channel 6
Ligand
BDBM466612
Substrate
Meas. Tech.
High Throughput Screening Assay
IC50
100.0±n/a nM
Citation
 Bouyssou, TGottschling, DHeine, NSmith Keenan, LLLowe, MDRazavi, HSarko, CRSurprenant, STakahashi, HTurner, MRWu, X Inhibitors of TRPC6 US Patent  US10889568 Publication Date 1/12/2021 
Target
Name:
Short transient receptor potential channel 6
Synonyms:
TRP-6 TRPC6 Transient receptor protein 6
Type:
PROTEIN
Mol. Mass.:
106326.67
Organism:
Homo sapiens (Human)
Description:
ChEMBL_107640
Residue:
931
  
Inhibitor
Name:
BDBM466612
Synonyms:
(6-Amino-4-methoxy-3',4',5',6'- tetrahydro-2'H-[3,4']bipyridinyl-1'-yl)- [4-methoxy-5-(4-methoxy-phenoxy)- pyridin-2-yl]-methanone US10889568, Compound 28
Type:
Small organic molecule
Emp. Form.:
C25H28N4O5
Mol. Mass.:
464.5136
SMILES:
COc1ccc(Oc2cnc(cc2OC)C(=O)N2CCC(CC2)c2cnc(N)cc2OC)cc1
: