Target
Short transient receptor potential channel 6
Ligand
BDBM466647
Substrate
Meas. Tech.
High Throughput Screening Assay
IC50
670±n/a nM
Citation
 Bouyssou, TGottschling, DHeine, NSmith Keenan, LLLowe, MDRazavi, HSarko, CRSurprenant, STakahashi, HTurner, MRWu, X Inhibitors of TRPC6 US Patent  US10889568 Publication Date 1/12/2021 
Target
Name:
Short transient receptor potential channel 6
Synonyms:
TRP-6 TRPC6 Transient receptor protein 6
Type:
PROTEIN
Mol. Mass.:
106326.67
Organism:
Homo sapiens (Human)
Description:
ChEMBL_107640
Residue:
931
  
Inhibitor
Name:
BDBM466647
Synonyms:
US10800757, Compound 63 [(S)-4-(6-Amino-4-methoxy-pyridin-3- yl)-2-hydroxymethyl-piperazin-1-yl]- [5-(4-fluoro-phenoxy)-4-methoxy- pyridin-2-yl]-methanone
Type:
Small organic molecule
Emp. Form.:
C24H26FN5O5
Mol. Mass.:
483.4921
SMILES:
COc1cc(ncc1Oc1ccc(F)cc1)C(=O)N1CCN(C[C@H]1CO)c1cnc(N)cc1OC
: