Target
Short transient receptor potential channel 6
Ligand
BDBM466661
Substrate
Meas. Tech.
High Throughput Screening Assay
IC50
1800±n/a nM
Citation
 Bouyssou, TGottschling, DHeine, NSmith Keenan, LLLowe, MDRazavi, HSarko, CRSurprenant, STakahashi, HTurner, MRWu, X Inhibitors of TRPC6 US Patent  US10889568 Publication Date 1/12/2021 
Target
Name:
Short transient receptor potential channel 6
Synonyms:
TRP-6 TRPC6 Transient receptor protein 6
Type:
PROTEIN
Mol. Mass.:
106326.67
Organism:
Homo sapiens (Human)
Description:
ChEMBL_107640
Residue:
931
  
Inhibitor
Name:
BDBM466661
Synonyms:
US10800757, Compound 76 [4-(6-Amino-pyridazin-3-yl)-piperidin- 1-yl]-(4-methoxy-5-propoxy-pyridin-2- yl)-methanone
Type:
Small organic molecule
Emp. Form.:
C19H25N5O3
Mol. Mass.:
371.4335
SMILES:
CCCOc1cnc(cc1OC)C(=O)N1CCC(CC1)c1ccc(N)nn1
: