Target
Short transient receptor potential channel 6
Ligand
BDBM466667
Substrate
Meas. Tech.
High Throughput Screening Assay
IC50
180±n/a nM
Citation
 Bouyssou, TGottschling, DHeine, NSmith Keenan, LLLowe, MDRazavi, HSarko, CRSurprenant, STakahashi, HTurner, MRWu, X Inhibitors of TRPC6 US Patent  US10889568 Publication Date 1/12/2021 
Target
Name:
Short transient receptor potential channel 6
Synonyms:
TRP-6 TRPC6 Transient receptor protein 6
Type:
PROTEIN
Mol. Mass.:
106326.67
Organism:
Homo sapiens (Human)
Description:
ChEMBL_107640
Residue:
931
  
Inhibitor
Name:
BDBM466667
Synonyms:
US10800757, Compound 82 [(R)-4-(6-Amino-pyridin-3-yl)-2- hydroxymethyl-piperazin-1-yl]-[4- methoxy-5-(4-methoxy-phenoxy)- pyridin-2-yl]-methanone
Type:
Small organic molecule
Emp. Form.:
C24H27N5O5
Mol. Mass.:
465.5017
SMILES:
COc1ccc(Oc2cnc(cc2OC)C(=O)N2CCN(C[C@@H]2CO)c2ccc(N)nc2)cc1
: