Target
Short transient receptor potential channel 6
Ligand
BDBM466671
Substrate
Meas. Tech.
High Throughput Screening Assay
IC50
350±n/a nM
Citation
 Bouyssou, TGottschling, DHeine, NSmith Keenan, LLLowe, MDRazavi, HSarko, CRSurprenant, STakahashi, HTurner, MRWu, X Inhibitors of TRPC6 US Patent  US10889568 Publication Date 1/12/2021 
Target
Name:
Short transient receptor potential channel 6
Synonyms:
TRP-6 TRPC6 Transient receptor protein 6
Type:
PROTEIN
Mol. Mass.:
106326.67
Organism:
Homo sapiens (Human)
Description:
ChEMBL_107640
Residue:
931
  
Inhibitor
Name:
BDBM466671
Synonyms:
(6-Amino-4-propoxy-3',4',5',6'- tetrahydro-2'H-[3,4']bipyridinyl-1'-yl)- [5-(phenoxy)-4-methoxy-pyridin-2-yl]- methanone US10889568, Compound 86
Type:
Small organic molecule
Emp. Form.:
C26H30N4O4
Mol. Mass.:
462.5408
SMILES:
CCCOc1cc(N)ncc1C1CCN(CC1)C(=O)c1cc(OC)c(Oc2ccccc2)cn1
: