Target
Vasopressin V1a receptor
Ligand
BDBM477581
Substrate
Meas. Tech.
Inhibition Activity Assay
IC50
18100±n/a nM
Citation
 Li, XHe, WWang, BZhang, ZHe, FTao, W Condensed ring group azacyclobutyl triazole derivative, preparation method therefor and use thereof in medicine US Patent  US10889569 Publication Date 1/12/2021 
Target
Name:
Vasopressin V1a receptor
Synonyms:
AVPR V1a AVPR1A V1AR_HUMAN VASOPRESSIN V1A Vasopressin V1 receptor Vasopressin receptor
Type:
Receptor
Mol. Mass.:
46820.18
Organism:
Homo sapiens (Human)
Description:
P37288
Residue:
418
  
Inhibitor
Name:
BDBM477581
Synonyms:
7-Fluoro-4-(1-(5-(methoxymethyl)-4-(6-methoxypyridin-3-yl)-4H-1,2,4-triazol-3-yl)azetidin-3-yl)quinoline 1 | US10889569, Example 1
Type:
Small organic molecule
Emp. Form.:
C22H21FN6O2
Mol. Mass.:
420.4395
SMILES:
COCc1nnc(N2CC(C2)c2ccnc3cc(F)ccc23)n1-c1ccc(OC)nc1
: