Target
Vasopressin V1a receptor
Ligand
BDBM477625
Substrate
Meas. Tech.
Inhibition Activity Assay
IC50
7000±n/a nM
Citation
 Li, XHe, WWang, BZhang, ZHe, FTao, W Condensed ring group azacyclobutyl triazole derivative, preparation method therefor and use thereof in medicine US Patent  US10889569 Publication Date 1/12/2021 
Target
Name:
Vasopressin V1a receptor
Synonyms:
AVPR V1a AVPR1A V1AR_HUMAN VASOPRESSIN V1A Vasopressin V1 receptor Vasopressin receptor
Type:
Receptor
Mol. Mass.:
46820.18
Organism:
Homo sapiens (Human)
Description:
P37288
Residue:
418
  
Inhibitor
Name:
BDBM477625
Synonyms:
1-(1-(4-(Benzo[d][1,3]dioxolan-5-yl)-5-(methoxymethyl)-4H-1,2,4-triazol-3-yl)azetidin-3-yl)-3-chloro-5-fluoro-1H-indole 3 | US10889569, Example 3
Type:
Small organic molecule
Emp. Form.:
C22H19ClFN5O3
Mol. Mass.:
455.869
SMILES:
COCc1nnc(N2CC(C2)n2cc(Cl)c3cc(F)ccc23)n1-c1ccc2OCOc2c1
: