Target
Vasopressin V1a receptor
Ligand
BDBM477654
Substrate
Meas. Tech.
Inhibition Activity Assay
IC50
2000±n/a nM
Citation
 Li, XHe, WWang, BZhang, ZHe, FTao, W Condensed ring group azacyclobutyl triazole derivative, preparation method therefor and use thereof in medicine US Patent  US10889569 Publication Date 1/12/2021 
Target
Name:
Vasopressin V1a receptor
Synonyms:
AVPR V1a AVPR1A V1AR_HUMAN VASOPRESSIN V1A Vasopressin V1 receptor Vasopressin receptor
Type:
Receptor
Mol. Mass.:
46820.18
Organism:
Homo sapiens (Human)
Description:
P37288
Residue:
418
  
Inhibitor
Name:
BDBM477654
Synonyms:
6-Fluoro-1-(1-(4-(6-methoxypyridin-3-yl)-5-(trifluoromethyl)-4H-1,2,4-triazol-3-yl) azetidin-3-yl)-1,2,3,4-tetrahydroquinoline 39 | US10889569, Example 39
Type:
Small organic molecule
Emp. Form.:
C21H20F4N6O
Mol. Mass.:
448.4167
SMILES:
COc1ccc(cn1)-n1c(nnc1C(F)(F)F)N1CC(C1)N1CCCc2cc(F)ccc12
: