Target
Vasopressin V1b receptor
Ligand
BDBM477637
Substrate
Meas. Tech.
Inhibition Activity Assay
IC50
59500±n/a nM
Citation
 Li, XHe, WWang, BZhang, ZHe, FTao, W Condensed ring group azacyclobutyl triazole derivative, preparation method therefor and use thereof in medicine US Patent  US10889569 Publication Date 1/12/2021 
Target
Name:
Vasopressin V1b receptor
Synonyms:
AVPR V1b AVPR1B Antidiuretic hormone receptor 1b V1bR VPR3 Vasopressin V1b receptor (V1b) Vasopressin V3 receptor
Type:
Enzyme
Mol. Mass.:
46985.01
Organism:
Homo sapiens (Human)
Description:
P47901
Residue:
424
  
Inhibitor
Name:
BDBM477637
Synonyms:
7-Fluoro-4-(1-(5-(methoxymethyl)-4-(6-methoxypyridin-3-yl)-4H-1,2,4-triazol-3-yl) azetidin-3-yl)-2H-benzo[b][1,4]oxazin-3(4H)-one 18 | US10889569, Example 18
Type:
Small organic molecule
Emp. Form.:
C21H21FN6O4
Mol. Mass.:
440.4276
SMILES:
COCc1nnc(N2CC(C2)N2C(=O)COc3cc(F)ccc23)n1-c1ccc(OC)nc1
: