Target
Vasopressin V2 receptor
Ligand
BDBM477635
Substrate
Meas. Tech.
Inhibition Activity Assay
IC50
11800±n/a nM
Citation
 Li, XHe, WWang, BZhang, ZHe, FTao, W Condensed ring group azacyclobutyl triazole derivative, preparation method therefor and use thereof in medicine US Patent  US10889569 Publication Date 1/12/2021 
Target
Name:
Vasopressin V2 receptor
Synonyms:
ADHR AVPR2 DIR Renal-type arginine vasopressin receptor V2R_HUMAN Vasopressin V2 receptor | Vasopressin receptor
Type:
Receptor
Mol. Mass.:
40295.28
Organism:
Homo sapiens (Human)
Description:
P30518
Residue:
371
  
Inhibitor
Name:
BDBM477635
Synonyms:
6-Fluoro-3-(1-(5-(methoxymethyl)-4-(6-methoxypyridin-3-yl)-4H-1,2,4-triazol-3-yl) azetidin-3-yl)-1-methyl-1H-indole 14 | US10889569, Example 14
Type:
Small organic molecule
Emp. Form.:
C22H23FN6O2
Mol. Mass.:
422.4554
SMILES:
COCc1nnc(N2CC(C2)c2cn(C)c3cc(F)ccc23)n1-c1ccc(OC)nc1
: