Target
Beta-secretase 2
Ligand
BDBM477899
Substrate
Meas. Tech.
In Vitro Enzymatic FRET (Fluorescence Resonance Energy Transfer) Assays
IC50
445±n/a nM
Citation
 Allen, JRAmegadzie, ABourbeau, MPChen, JJFrohn, MJHarrington, PELow, JDMa, VVNguyen, TTPickrell, AReeves, C Cyclopropyl fused thiazine derivatives as beta-secretase inhibitors and methods of use US Patent  US10889581 Publication Date 1/12/2021 
Target
Name:
Beta-secretase 2
Synonyms:
AEPLC ASP1 Asp 1 Aspartyl protease 1 BACE2_HUMAN Beta-secretase (BACE) Beta-secretase 2 (BACE-2) Beta-site APP-cleaving enzyme 2 Memapsin-1 beta-Secretase (BACE-2)
Type:
Protein
Mol. Mass.:
56171.20
Organism:
Homo sapiens (Human)
Description:
Q9Y5Z0
Residue:
518
  
Inhibitor
Name:
BDBM477899
Synonyms:
(1S,5S,6S)-5-(5-((5-chloropyridin-2-yl)ethynyl)-2-fluorophenyl)-1,5-bis(fluoromethyl)-2-thia-4-azabicyclo[4.1.0]hept-3-en-3-amine | US10889581, Example 102
Type:
Small organic molecule
Emp. Form.:
C20H15ClF3N3S
Mol. Mass.:
421.866
SMILES:
NC1=N[C@@](CF)([C@@H]2C[C@]2(CF)S1)c1cc(ccc1F)C#Cc1ccc(Cl)cn1
: