Target
Cathepsin D
Ligand
BDBM477903
Substrate
Meas. Tech.
In Vitro Enzymatic FRET Assay
IC50
614300±n/a nM
Citation
 Allen, JRAmegadzie, ABourbeau, MPChen, JJFrohn, MJHarrington, PELow, JDMa, VVNguyen, TTPickrell, AReeves, C Cyclopropyl fused thiazine derivatives as beta-secretase inhibitors and methods of use US Patent  US10889581 Publication Date 1/12/2021 
Target
Name:
Cathepsin D
Synonyms:
CATD_HUMAN CTSD Cathepsin D heavy chain Cathepsin D precursor
Type:
Enzyme
Mol. Mass.:
44551.72
Organism:
Homo sapiens (Human)
Description:
Human proCathepsin D (SwissProt accession number P07339) was expressed in Sf9 cells, purified, and autoactivated.
Residue:
412
  
Inhibitor
Name:
BDBM477903
Synonyms:
6-((3-((1R,5S,6S)-3-amino-1-(cyanomethyl)-5-(fluoromethyl)-2-thia-4-azabicyclo[4.1.0]hept-3-en-5-yl)-4-fluorophenyl)ethynyl)nicotinonitrile | US10889581, Example 106
Type:
Small organic molecule
Emp. Form.:
C22H15F2N5S
Mol. Mass.:
419.45
SMILES:
NC1=N[C@@](CF)([C@@H]2C[C@]2(CC#N)S1)c1cc(ccc1F)C#Cc1ccc(cn1)C#N
: