Target
Cathepsin D
Ligand
BDBM477907
Substrate
Meas. Tech.
In Vitro Enzymatic FRET Assay
IC50
1162200±n/a nM
Citation
 Allen, JRAmegadzie, ABourbeau, MPChen, JJFrohn, MJHarrington, PELow, JDMa, VVNguyen, TTPickrell, AReeves, C Cyclopropyl fused thiazine derivatives as beta-secretase inhibitors and methods of use US Patent  US10889581 Publication Date 1/12/2021 
Target
Name:
Cathepsin D
Synonyms:
CATD_HUMAN CTSD Cathepsin D heavy chain Cathepsin D precursor
Type:
Enzyme
Mol. Mass.:
44551.72
Organism:
Homo sapiens (Human)
Description:
Human proCathepsin D (SwissProt accession number P07339) was expressed in Sf9 cells, purified, and autoactivated.
Residue:
412
  
Inhibitor
Name:
BDBM477907
Synonyms:
6-((3-((1S,5S,6R)-3-amino-7,7-difluoro-1-(hydroxymethyl)-5-methyl-2-thia-4-azabicyclo[4.1.0]hept-3-en-5-yl)-4-fluorophenyl)ethynyl)nicotinonitrile | US10889581, Example 110
Type:
Small organic molecule
Emp. Form.:
C21H15F3N4OS
Mol. Mass.:
428.43
SMILES:
C[C@@]1(N=C(N)S[C@]2(CO)[C@H]1C2(F)F)c1cc(ccc1F)C#Cc1ccc(cn1)C#N
: