Target
Beta-secretase 2
Ligand
BDBM477914
Substrate
Meas. Tech.
In Vitro Enzymatic FRET (Fluorescence Resonance Energy Transfer) Assays
IC50
12.0±n/a nM
Citation
 Allen, JRAmegadzie, ABourbeau, MPChen, JJFrohn, MJHarrington, PELow, JDMa, VVNguyen, TTPickrell, AReeves, C Cyclopropyl fused thiazine derivatives as beta-secretase inhibitors and methods of use US Patent  US10889581 Publication Date 1/12/2021 
Target
Name:
Beta-secretase 2
Synonyms:
AEPLC ASP1 Asp 1 Aspartyl protease 1 BACE2_HUMAN Beta-secretase (BACE) Beta-secretase 2 (BACE-2) Beta-site APP-cleaving enzyme 2 Memapsin-1 beta-Secretase (BACE-2)
Type:
Protein
Mol. Mass.:
56171.20
Organism:
Homo sapiens (Human)
Description:
Q9Y5Z0
Residue:
518
  
Inhibitor
Name:
BDBM477914
Synonyms:
(E)-3-((1R,5S,6S)-3-amino-5-(5-((5-chloropyrimidin-2-yl)ethynyl)-2-fluorophenyl)-5-(fluoromethyl)-2-thia-4-azabicyclo[4.1.0]hept-3-en-1-yl)-1-morpholinoprop-2-en-1-one | US10889581, Example 117
Type:
Small organic molecule
Emp. Form.:
C25H22ClF2N5O2S
Mol. Mass.:
529.989
SMILES:
NC1=N[C@@](CF)([C@@H]2C[C@@]2(S1)\C=C\C(=O)N1CCOCC1)c1cc(ccc1F)C#Cc1ncc(Cl)cn1
: