Target
Beta-secretase 1
Ligand
BDBM477920
Substrate
Meas. Tech.
In Vitro Enzymatic FRET (Fluorescence Resonance Energy Transfer) Assays
IC50
3.00±n/a nM
Citation
 Allen, JRAmegadzie, ABourbeau, MPChen, JJFrohn, MJHarrington, PELow, JDMa, VVNguyen, TTPickrell, AReeves, C Cyclopropyl fused thiazine derivatives as beta-secretase inhibitors and methods of use US Patent  US10889581 Publication Date 1/12/2021 
Target
Name:
Beta-secretase 1
Synonyms:
ASP2 Aspartyl protease 2 BACE1 Beta-secretase (BACE) Beta-secretase 1 (BACE 1) Beta-secretase 1 (BACE1) Beta-site amyloid precursor protein cleaving enzyme 1 Memapsin-2 beta-Secretase (BACE-1) | beta-Secretase (BACE1)
Type:
Protein
Mol. Mass.:
55755.10
Organism:
Homo sapiens (Human)
Description:
P56817
Residue:
501
  
Inhibitor
Name:
BDBM477920
Synonyms:
(1S,5S,6S)-3-amino-5-(5-((5-cyano-3-methyl-2-pyridinyl)ethynyl)-2-fluorophenyl)-N,N,5-trimethyl-2-thia-4-azabicyclo[4.1.0]hept-3-ene-1-carboxamide | US10889581, Example 123
Type:
Small organic molecule
Emp. Form.:
C24H22FN5OS
Mol. Mass.:
447.528
SMILES:
CN(C)C(=O)[C@]12C[C@H]1[C@](C)(N=C(N)S2)c1cc(ccc1F)C#Cc1ncc(cc1C)C#N
: