Target
Beta-secretase 1
Ligand
BDBM477921
Substrate
Meas. Tech.
In Vitro Enzymatic FRET (Fluorescence Resonance Energy Transfer) Assays
IC50
49.0±n/a nM
Citation
 Allen, JRAmegadzie, ABourbeau, MPChen, JJFrohn, MJHarrington, PELow, JDMa, VVNguyen, TTPickrell, AReeves, C Cyclopropyl fused thiazine derivatives as beta-secretase inhibitors and methods of use US Patent  US10889581 Publication Date 1/12/2021 
Target
Name:
Beta-secretase 1
Synonyms:
ASP2 Aspartyl protease 2 BACE1 Beta-secretase (BACE) Beta-secretase 1 (BACE 1) Beta-secretase 1 (BACE1) Beta-site amyloid precursor protein cleaving enzyme 1 Memapsin-2 beta-Secretase (BACE-1) | beta-Secretase (BACE1)
Type:
Protein
Mol. Mass.:
55755.10
Organism:
Homo sapiens (Human)
Description:
P56817
Residue:
501
  
Inhibitor
Name:
BDBM477921
Synonyms:
6-((3-((1R,5S,6S)-3-amino-5-(fluoromethyl)-1-((E)-3-morpholino-3-oxoprop-1-en-1-yl)-2-thia-4-azabicyclo[4.1.0]hept-3-en-5-yl)-4-fluorophenyl)ethynyl)-5-fluoronicotinonitrile | US10889581, Example 124
Type:
Small organic molecule
Emp. Form.:
C27H22F3N5O2S
Mol. Mass.:
537.556
SMILES:
NC1=N[C@@](CF)([C@@H]2C[C@@]2(S1)\C=C\C(=O)N1CCOCC1)c1cc(ccc1F)C#Cc1ncc(cc1F)C#N
: