Target
Cathepsin D
Ligand
BDBM477924
Substrate
Meas. Tech.
In Vitro Enzymatic FRET Assay
IC50
968900±n/a nM
Citation
 Allen, JRAmegadzie, ABourbeau, MPChen, JJFrohn, MJHarrington, PELow, JDMa, VVNguyen, TTPickrell, AReeves, C Cyclopropyl fused thiazine derivatives as beta-secretase inhibitors and methods of use US Patent  US10889581 Publication Date 1/12/2021 
Target
Name:
Cathepsin D
Synonyms:
CATD_HUMAN CTSD Cathepsin D heavy chain Cathepsin D precursor
Type:
Enzyme
Mol. Mass.:
44551.72
Organism:
Homo sapiens (Human)
Description:
Human proCathepsin D (SwissProt accession number P07339) was expressed in Sf9 cells, purified, and autoactivated.
Residue:
412
  
Inhibitor
Name:
BDBM477924
Synonyms:
(1S,5S,6S)-3-amino-5-(5-((5-cyano-3-methylpyridin-2-yl)ethynyl)-2-fluorophenyl)-5-(fluoromethyl)-N,N-dimethyl-2-thia-4-azabicyclo[4.1.0]hept-3-ene-1-carboxamide | US10889581, Example 127
Type:
Small organic molecule
Emp. Form.:
C24H21F2N5OS
Mol. Mass.:
465.518
SMILES:
CN(C)C(=O)[C@]12C[C@H]1[C@](CF)(N=C(N)S2)c1cc(ccc1F)C#Cc1ncc(cc1C)C#N
: