Target
Ubiquitin carboxyl-terminal hydrolase 28
Ligand
BDBM478023
Substrate
Meas. Tech.
Biochemical Assay
IC50
<200±n/a nM
Citation
 Guerin, DJBair, KWCaravella, JAIoannidis, Jr., SLancia, Jr., DRLi, HMischke, SNg, PYRichard, DSchiller, SEShelekhin, TWang, Z Thienopyrazine carboxamides as ubiquitin-specific protease inhibitors US Patent  US10889592 Publication Date 1/12/2021 
Target
Name:
Ubiquitin carboxyl-terminal hydrolase 28
Synonyms:
3.4.19.12 KIAA1515 USP28 Ubiquitin thioesterase 28 | Ubiquitin-specific-processing protease 28
Type:
PROTEIN
Mol. Mass.:
122456.92
Organism:
Homo sapiens
Description:
ChEMBL_105199
Residue:
1077
  
Inhibitor
Name:
BDBM478023
Synonyms:
US10889592, Compound I-3 | US11325917, Compound I-3
Type:
Small organic molecule
Emp. Form.:
C22H25ClN6OS
Mol. Mass.:
456.992
SMILES:
Cc1cnc2c(N)c(sc2n1)C(=O)NCCc1ccc(N2CC3CCC(C2)N3)c(Cl)c1
: