Target
Ubiquitin carboxyl-terminal hydrolase 28
Ligand
BDBM478025
Substrate
Meas. Tech.
Biochemical Assay
IC50
6000±n/a nM
Citation
 Guerin, DJBair, KWCaravella, JAIoannidis, Jr., SLancia, Jr., DRLi, HMischke, SNg, PYRichard, DSchiller, SEShelekhin, TWang, Z Thienopyrazine carboxamides as ubiquitin-specific protease inhibitors US Patent  US10889592 Publication Date 1/12/2021 
Target
Name:
Ubiquitin carboxyl-terminal hydrolase 28
Synonyms:
3.4.19.12 KIAA1515 USP28 Ubiquitin thioesterase 28 | Ubiquitin-specific-processing protease 28
Type:
PROTEIN
Mol. Mass.:
122456.92
Organism:
Homo sapiens
Description:
ChEMBL_105199
Residue:
1077
  
Inhibitor
Name:
BDBM478025
Synonyms:
US10889592, Compound I-23 | US10889592, Compound I-5
Type:
Small organic molecule
Emp. Form.:
C22H26N6OS
Mol. Mass.:
422.546
SMILES:
Cc1cnc2c(N)c(sc2n1)C(=O)NCCc1ccc(cc1)N1C2CCC1CNC2
: