Target
Solute carrier family 22 member 12
Ligand
BDBM478091
Substrate
Meas. Tech.
URAT1 In Vitro Inhibition Activity-Method B
IC50
55.0±n/a nM
Citation
 Li, TZhao, XYu, CTan, HWang, XTan, RLiu, BZhang, WZhang, HLiu, QZhou, ZLi, ZRong, YSun, JWang, W Indolizine derivatives, composition and methods of use US Patent  US10894038 Publication Date 1/19/2021 
Target
Name:
Solute carrier family 22 member 12
Synonyms:
OATL4 RST S22AC_HUMAN Solute carrier family 22 member 12 URAT1 Urate anion exchanger 1 (URAT1) | Uric Acid Transporter 1 (URAT1)
Type:
Enzyme
Mol. Mass.:
59638.65
Organism:
Homo sapiens (Human)
Description:
Q96S37
Residue:
553
  
Inhibitor
Name:
BDBM478091
Synonyms:
1-((3-(5-cyanoindolizin-8-yl)pyridin-4-yl)thio)cyclobutane-1-carboxylic acid | US10894038, Example 8
Type:
Small organic molecule
Emp. Form.:
C19H15N3O2S
Mol. Mass.:
349.406
SMILES:
OC(=O)C1(CCC1)Sc1ccncc1-c1ccc(C#N)n2cccc12
: