Target
Fibroblast growth factor receptor 2
Ligand
BDBM161392
Substrate
Meas. Tech.
Measurement of Inhibitory Effect on FGFR2 Kinase Activity
IC50
1.10±n/a nM
Citation
 Ochiiwa, HHirai, H Antitumor drug for intermittent administration of FGFR inhibitor US Patent  US10894048 Publication Date 1/19/2021 
Target
Name:
Fibroblast growth factor receptor 2
Synonyms:
BEK FGFR-2 FGFR2 Fibroblast growth factor receptor 2 (FGFR2) KGFR Keratinocyte growth factor receptor VEGF-receptor 2 and Fibroblast growth factor receptor 2
Type:
Enzyme
Mol. Mass.:
92015.45
Organism:
Homo sapiens (Human)
Description:
P21802
Residue:
821
  
Inhibitor
Name:
BDBM161392
Synonyms:
US10124003, Ex. Compound 5 US10894048, Ex Comp 5 | US9108973, 5
Type:
Small organic molecule
Emp. Form.:
C22H20N6O3
Mol. Mass.:
416.4326
SMILES:
COc1cc(OC)cc(c1)C#Cc1nn([C@H]2CCN(C2)C(=O)C#C)c2ncnc(N)c12
: