Target
Fibroblast growth factor receptor 2
Ligand
BDBM161451
Substrate
Meas. Tech.
Measurement of Inhibitory Effect on FGFR2 Kinase Activity
IC50
7.90±n/a nM
Citation
 Ochiiwa, HHirai, H Antitumor drug for intermittent administration of FGFR inhibitor US Patent  US10894048 Publication Date 1/19/2021 
Target
Name:
Fibroblast growth factor receptor 2
Synonyms:
BEK FGFR-2 FGFR2 Fibroblast growth factor receptor 2 (FGFR2) KGFR Keratinocyte growth factor receptor VEGF-receptor 2 and Fibroblast growth factor receptor 2
Type:
Enzyme
Mol. Mass.:
92015.45
Organism:
Homo sapiens (Human)
Description:
P21802
Residue:
821
  
Inhibitor
Name:
BDBM161451
Synonyms:
US10124003, Ex. Compound 64 US10894048, Ex Comp 64 | US9108973, 64
Type:
Small organic molecule
Emp. Form.:
C24H25N5O3
Mol. Mass.:
431.487
SMILES:
COc1cc(OC)cc(c1)C#Cc1cn(C2CCN(CC2)C(=O)C=C)c2ncnc(N)c12
: