Target
Fibroblast growth factor receptor 2
Ligand
BDBM161462
Substrate
Meas. Tech.
Measurement of Inhibitory Effect on FGFR2 Kinase Activity
IC50
190±n/a nM
Citation
 Ochiiwa, HHirai, H Antitumor drug for intermittent administration of FGFR inhibitor US Patent  US10894048 Publication Date 1/19/2021 
Target
Name:
Fibroblast growth factor receptor 2
Synonyms:
BEK FGFR-2 FGFR2 Fibroblast growth factor receptor 2 (FGFR2) KGFR Keratinocyte growth factor receptor VEGF-receptor 2 and Fibroblast growth factor receptor 2
Type:
Enzyme
Mol. Mass.:
92015.45
Organism:
Homo sapiens (Human)
Description:
P21802
Residue:
821
  
Inhibitor
Name:
BDBM161462
Synonyms:
US10835536, Ref. Ex. Comp 3 US9108973, Ref 3
Type:
Small organic molecule
Emp. Form.:
C22H24N6O3
Mol. Mass.:
420.4644
SMILES:
CCC(=O)N1CC[C@@H](C1)n1nc(C#Cc2cc(OC)cc(OC)c2)c2c(N)ncnc12
: