Target
Fibroblast growth factor receptor 4
Ligand
BDBM161389
Substrate
Meas. Tech.
Measurement of Inhibitory Effect on FGFR4 Kinase Activity
IC50
3.40±n/a nM
Citation
 Ochiiwa, HHirai, H Antitumor drug for intermittent administration of FGFR inhibitor US Patent  US10894048 Publication Date 1/19/2021 
Target
Name:
Fibroblast growth factor receptor 4
Synonyms:
CD_antigen: CD334 FGFR4 FGFR4 Fibroblast growth factor receptor JK2 TKF
Type:
Protein
Mol. Mass.:
87957.45
Organism:
Homo sapiens (Human)
Description:
P22455
Residue:
802
  
Inhibitor
Name:
BDBM161389
Synonyms:
US10124003, Ref. Ex. Compound 3 US10894048, Ex Comp 2 | US9108973, 2
Type:
Small organic molecule
Emp. Form.:
C22H22N6O3
Mol. Mass.:
418.4485
SMILES:
COc1cc(OC)cc(c1)C#Cc1nn([C@H]2CCN(C2)C(=O)C=C)c2ncnc(N)c12
: