Target
Fibroblast growth factor receptor 3
Ligand
BDBM161396
Substrate
Meas. Tech.
Measurement of Inhibitory Effect on FGFR3 Kinase Activity
IC50
0.300±n/a nM
Citation
 Ochiiwa, HHirai, H Antitumor drug for intermittent administration of FGFR inhibitor US Patent  US10894048 Publication Date 1/19/2021 
Target
Name:
Fibroblast growth factor receptor 3
Synonyms:
CD_antigen: CD333 FGFR3 Fibroblast growth factor receptor JTK4
Type:
Protein
Mol. Mass.:
87699.57
Organism:
Homo sapiens (Human)
Description:
P22607
Residue:
806
  
Inhibitor
Name:
BDBM161396
Synonyms:
US10124003, Ex. Compound 9 US10894048, Ex Comp 51 | US9108973, 9
Type:
Small organic molecule
Emp. Form.:
C21H20N6O3
Mol. Mass.:
404.4219
SMILES:
COc1cc(OC)cc(c1)C#Cc1nn(C2CN(C2)C(=O)C=C)c2ncnc(N)c12
: