Target
Transitional endoplasmic reticulum ATPase
Ligand
BDBM478153
Substrate
Meas. Tech.
Biomol Green Assay
IC50
44.0±n/a nM
Citation
 Huryn, DMWipf, PLaPorte, MG Modulators of P97 AAA ATPase activity US Patent  US10894782 Publication Date 1/19/2021 
Target
Name:
Transitional endoplasmic reticulum ATPase
Synonyms:
TERA_HUMAN VCP Valosin-containing protein
Type:
Enzyme
Mol. Mass.:
89300.63
Organism:
Homo sapiens (Human)
Description:
P55072
Residue:
806
  
Inhibitor
Name:
BDBM478153
Synonyms:
US10894782, No 6
Type:
Small organic molecule
Emp. Form.:
C28H31N5O4S
Mol. Mass.:
533.642
SMILES:
Cc1cc(OCc2nnc(SC3CCCC3)n2-c2cccnc2)ccc1C#CCOC(=O)N1CCOCC1
: