Target
Transitional endoplasmic reticulum ATPase
Ligand
BDBM478182
Substrate
Meas. Tech.
Biomol Green Assay
IC50
64.0±n/a nM
Citation
 Huryn, DMWipf, PLaPorte, MG Modulators of P97 AAA ATPase activity US Patent  US10894782 Publication Date 1/19/2021 
Target
Name:
Transitional endoplasmic reticulum ATPase
Synonyms:
TERA_HUMAN VCP Valosin-containing protein
Type:
Enzyme
Mol. Mass.:
89300.63
Organism:
Homo sapiens (Human)
Description:
P55072
Residue:
806
  
Inhibitor
Name:
BDBM478182
Synonyms:
US10894782, No 35
Type:
Small organic molecule
Emp. Form.:
C29H30N6O4S
Mol. Mass.:
558.651
SMILES:
Cc1cc(CNC(=O)OCC#Cc2ccc(OCc3nnc(SC4CCCC4)n3-c3cccnc3)cc2C)no1
: