Target
Transitional endoplasmic reticulum ATPase
Ligand
BDBM478194
Substrate
Meas. Tech.
Biomol Green Assay
IC50
290±n/a nM
Citation
 Huryn, DMWipf, PLaPorte, MG Modulators of P97 AAA ATPase activity US Patent  US10894782 Publication Date 1/19/2021 
Target
Name:
Transitional endoplasmic reticulum ATPase
Synonyms:
TERA_HUMAN VCP Valosin-containing protein
Type:
Enzyme
Mol. Mass.:
89300.63
Organism:
Homo sapiens (Human)
Description:
P55072
Residue:
806
  
Inhibitor
Name:
BDBM478194
Synonyms:
US10894782, No 47
Type:
Small organic molecule
Emp. Form.:
C32H27N5O3S
Mol. Mass.:
561.653
SMILES:
Cc1cc(OCc2nnc(SC3CCCC=C3)n2-c2cccnc2)ccc1C#CCN1C(=O)c2ccccc2C1=O
: