Target
Transitional endoplasmic reticulum ATPase
Ligand
BDBM478215
Substrate
Meas. Tech.
Biomol Green Assay
IC50
170±n/a nM
Citation
 Huryn, DMWipf, PLaPorte, MG Modulators of P97 AAA ATPase activity US Patent  US10894782 Publication Date 1/19/2021 
Target
Name:
Transitional endoplasmic reticulum ATPase
Synonyms:
TERA_HUMAN VCP Valosin-containing protein
Type:
Enzyme
Mol. Mass.:
89300.63
Organism:
Homo sapiens (Human)
Description:
P55072
Residue:
806
  
Inhibitor
Name:
BDBM478215
Synonyms:
US10894782, No 68
Type:
Small organic molecule
Emp. Form.:
C30H39N7OS
Mol. Mass.:
545.742
SMILES:
CN1CCN(CCNCC#Cc2ccc(OCc3nnc(SC4CCCC4)n3-c3cccnc3)cc2C)CC1
: