Target
Transitional endoplasmic reticulum ATPase
Ligand
BDBM478229
Substrate
Meas. Tech.
Biomol Green Assay
IC50
43.0±n/a nM
Citation
 Huryn, DMWipf, PLaPorte, MG Modulators of P97 AAA ATPase activity US Patent  US10894782 Publication Date 1/19/2021 
Target
Name:
Transitional endoplasmic reticulum ATPase
Synonyms:
TERA_HUMAN VCP Valosin-containing protein
Type:
Enzyme
Mol. Mass.:
89300.63
Organism:
Homo sapiens (Human)
Description:
P55072
Residue:
806
  
Inhibitor
Name:
BDBM478229
Synonyms:
US10894782, No 82
Type:
Small organic molecule
Emp. Form.:
C32H36F3N7O3S
Mol. Mass.:
655.734
SMILES:
CN1CCN(CCNC(=O)OCC#Cc2ccc(OCc3nnc(SC4CCCC=C4)n3-c3cccnc3)cc2C(F)(F)F)CC1
: