Target
Transitional endoplasmic reticulum ATPase
Ligand
BDBM478277
Substrate
Meas. Tech.
Biomol Green Assay
IC50
2775±n/a nM
Citation
 Huryn, DMWipf, PLaPorte, MG Modulators of P97 AAA ATPase activity US Patent  US10894782 Publication Date 1/19/2021 
Target
Name:
Transitional endoplasmic reticulum ATPase
Synonyms:
TERA_HUMAN VCP Valosin-containing protein
Type:
Enzyme
Mol. Mass.:
89300.63
Organism:
Homo sapiens (Human)
Description:
P55072
Residue:
806
  
Inhibitor
Name:
BDBM478277
Synonyms:
US10894782, No 132
Type:
Small organic molecule
Emp. Form.:
C24H24ClN5O3S
Mol. Mass.:
497.997
SMILES:
CCC(=O)NCC#Cc1ccc(OCc2nnc(SCC(=O)CCl)n2-c2cccnc2)cc1C
: