Target
Serine/threonine-protein kinase TBK1
Ligand
BDBM478614
Substrate
Meas. Tech.
TBK1 Low ATP Kinase Assay
IC50
0.700±n/a nM
Citation
 Schulze, VHeinrich, TPrinz, FLefranc, JSchröder, JMengel, ABone, WBálint, JWengner, AMEis, KIrlbacher, HKoppitz, MBömer, UBader, BBriem, HLienau, PChrist, CStöckigt, DHillig, R Heteroarylbenzimidazole compounds US Patent  US10894784 Publication Date 1/19/2021 
Target
Name:
Serine/threonine-protein kinase TBK1
Synonyms:
NAK Protein cereblon/Serine/threonine-protein kinase TBK1 TANK-binding kinase 1 (TBK-1) TBK1 | TBK1_HUMAN
Type:
protein
Mol. Mass.:
83645.20
Organism:
Homo sapiens (Human)
Description:
Q9UHD2
Residue:
729
  
Inhibitor
Name:
BDBM478614
Synonyms:
3,3,3-trifluoro-1-(4-{(1R or 1S)-1-[2-({6-[6-(methoxymethyl)pyrimidin-4-yl]-1H-benzimidazol-2-yl}amino)pyridin-4-yl]ethyl}piperazin-1-yl)propan-1-one | US10894784, Example 84.02
Type:
Small organic molecule
Emp. Form.:
C27H29F3N8O2
Mol. Mass.:
554.5668
SMILES:
COCc1cc(ncn1)-c1ccc2nc(Nc3cc(ccn3)C(C)N3CCN(CC3)C(=O)CC(F)(F)F)[nH]c2c1
: