Target
Serine/threonine-protein kinase TBK1
Ligand
BDBM478717
Substrate
Meas. Tech.
TBK1 Low ATP Kinase Assay
IC50
1.40±n/a nM
Citation
 Schulze, VHeinrich, TPrinz, FLefranc, JSchröder, JMengel, ABone, WBálint, JWengner, AMEis, KIrlbacher, HKoppitz, MBömer, UBader, BBriem, HLienau, PChrist, CStöckigt, DHillig, R Heteroarylbenzimidazole compounds US Patent  US10894784 Publication Date 1/19/2021 
Target
Name:
Serine/threonine-protein kinase TBK1
Synonyms:
NAK Protein cereblon/Serine/threonine-protein kinase TBK1 TANK-binding kinase 1 (TBK-1) TBK1 | TBK1_HUMAN
Type:
protein
Mol. Mass.:
83645.20
Organism:
Homo sapiens (Human)
Description:
Q9UHD2
Residue:
729
  
Inhibitor
Name:
BDBM478717
Synonyms:
US10894784, Example 115.01 | tert-butyl 4-{(1R or 1S)-1-[2-({6-[6-(azetidin-1-yl)pyrimidin-4-yl]-1H-benzimidazol-2-yl}amino)pyridin-4-yl]ethyl}piperazine-1-carboxylate
Type:
Small organic molecule
Emp. Form.:
C30H37N9O2
Mol. Mass.:
555.6739
SMILES:
CC(N1CCN(CC1)C(=O)OC(C)(C)C)c1ccnc(Nc2nc3ccc(cc3[nH]2)-c2cc(ncn2)N2CCC2)c1
: