Target
Serine/threonine-protein kinase TBK1
Ligand
BDBM478857
Substrate
Meas. Tech.
TBK1 Low ATP Kinase Assay
IC50
1.79±n/a nM
Citation
 Schulze, VHeinrich, TPrinz, FLefranc, JSchröder, JMengel, ABone, WBálint, JWengner, AMEis, KIrlbacher, HKoppitz, MBömer, UBader, BBriem, HLienau, PChrist, CStöckigt, DHillig, R Heteroarylbenzimidazole compounds US Patent  US10894784 Publication Date 1/19/2021 
Target
Name:
Serine/threonine-protein kinase TBK1
Synonyms:
NAK Protein cereblon/Serine/threonine-protein kinase TBK1 TANK-binding kinase 1 (TBK-1) TBK1 | TBK1_HUMAN
Type:
protein
Mol. Mass.:
83645.20
Organism:
Homo sapiens (Human)
Description:
Q9UHD2
Residue:
729
  
Inhibitor
Name:
BDBM478857
Synonyms:
US10894784, Example 165.03
Type:
Small organic molecule
Emp. Form.:
C29H32F2N8O2
Mol. Mass.:
562.6136
SMILES:
CC(N1CCN(CC1)C(=O)C1CC1)c1ccnc(Nc2nc3ccc(cc3[nH]2)-c2cc(OCC(C)(F)F)ncn2)c1
: