Target
Cyclin-dependent kinase 13
Ligand
BDBM478939
Substrate
Meas. Tech.
Biochemical Assay for CDK13
IC50
29.0±n/a nM
Citation
 Poddutoori, RSamajdar, SMukherjee, S Substituted pyrazole derivatives as selective CDK12/13 inhibitors US Patent  US10894786 Publication Date 1/19/2021 
Target
Name:
Cyclin-dependent kinase 13
Synonyms:
CDC2-related protein kinase 5 CDC2L5 CDK13_HUMAN Cell division cycle 2-like protein kinase 5 Cholinesterase-related cell division controller hCDK13
Type:
PROTEIN
Mol. Mass.:
165002.38
Organism:
Homo sapiens (Human)
Description:
ChEMBL_774241
Residue:
1512
  
Inhibitor
Name:
BDBM478939
Synonyms:
2-(6-(1-acryloylpiperidin-3-yl)pyridin-3-yl)-N-(5-cyclopropyl-1H-pyrazol-3- yl)propanamide | US10894786, Comp. No 41
Type:
Small organic molecule
Emp. Form.:
C22H27N5O2
Mol. Mass.:
393.4821
SMILES:
CC(C(=O)Nc1cc([nH]n1)C1CC1)c1ccc(nc1)C1CCCN(C1)C(=O)C=C
: