Target
Cyclin-dependent kinase 13
Ligand
BDBM478951
Substrate
Meas. Tech.
Biochemical Assay for CDK13
IC50
0.900±n/a nM
Citation
 Poddutoori, RSamajdar, SMukherjee, S Substituted pyrazole derivatives as selective CDK12/13 inhibitors US Patent  US10894786 Publication Date 1/19/2021 
Target
Name:
Cyclin-dependent kinase 13
Synonyms:
CDC2-related protein kinase 5 CDC2L5 CDK13_HUMAN Cell division cycle 2-like protein kinase 5 Cholinesterase-related cell division controller hCDK13
Type:
PROTEIN
Mol. Mass.:
165002.38
Organism:
Homo sapiens (Human)
Description:
ChEMBL_774241
Residue:
1512
  
Inhibitor
Name:
BDBM478951
Synonyms:
2-(6-(1-acryloyl-2,5-dihydro-1H-pyrrol-3-yl)pyridin-3-yl)-N-(5-cyclopropyl-1H- pyrazol-3-yl)acetamide | US10894786, Comp. No 53
Type:
Small organic molecule
Emp. Form.:
C20H21N5O2
Mol. Mass.:
363.413
SMILES:
C=CC(=O)N1CC=C(C1)c1ccc(CC(=O)Nc2cc([nH]n2)C2CC2)cn1
: